Target
Indoleamine 2,3-dioxygenase 1
Ligand
BDBM50303910
Substrate
Meas. Tech.
ChEMBL_595173 (CHEMBL1040015)
IC50
20000±n/a nM
Citation
 Röhrig, UFAwad, LGrosdidier, ALarrieu, PStroobant, VColau, DCerundolo, VSimpson, AJVogel, PVan den Eynde, BJZoete, VMichielin, O Rational design of indoleamine 2,3-dioxygenase inhibitors. J Med Chem 53:1172-89 (2010)  
Target
Name:
Indoleamine 2,3-dioxygenase 1
Synonyms:
I23O1_MOUSE Ido Indo | Indoleamine-pyrrole 2,3-dioxygenase
Type:
PROTEIN
Mol. Mass.:
45639.39
Organism:
Mus musculus
Description:
ChEMBL_1452149
Residue:
407
  
Inhibitor
Name:
BDBM50303910
Synonyms:
4-phenylthiazole-2-thiol | CHEMBL571436
Type:
Small organic molecule
Emp. Form.:
C9H7NS2
Mol. Mass.:
193.289
SMILES:
Sc1nc(cs1)-c1ccccc1
: