Target
Cyclin-H/Cyclin-dependent kinase 7
Ligand
BDBM50378657
Substrate
Meas. Tech.
ChEMBL_608388 (CHEMBL1074422)
IC50
10±n/a nM
Citation
 Brasca, MGAlbanese, CAlzani, RAmici, RAvanzi, NBallinari, DBischoff, JBorghi, DCasale, ECroci, VFiorentini, FIsacchi, AMercurio, CNesi, MOrsini, PPastori, WPesenti, EPevarello, PRoussel, PVarasi, MVolpi, DVulpetti, ACiomei, M Optimization of 6,6-dimethyl pyrrolo[3,4-c]pyrazoles: Identification of PHA-793887, a potent CDK inhibitor suitable for intravenous dosing. Bioorg Med Chem 18:1844-53 (2010)  
Target
Name:
Cyclin-H/Cyclin-dependent kinase 7
Synonyms:
CDK-activating kinase assembly factor MAT1/Cyclin H/Cyclin-dependent kinase 7 CDK7/H Cyclin-Dependent Kinase 7 (CDK7) Cyclin-dependent kinase 7/cyclin H
Type:
Protein Complex
Mol. Mass.:
Description:
Components:
This complex has 2 components.
Component 1
Name:
Cyclin-H
Synonyms:
CCNH Cyclin H p34 | p37
Type:
Enzyme Subunit
Mol. Mass.:
37646.05
Organism:
Homo sapiens (Human)
Description:
Residue:
323
  
Component 2
Name:
Cyclin-dependent kinase 7
Synonyms:
39 kDa protein kinase CAK1 CDK-activating kinase 1 (CAK) CDK7_HUMAN Cell division protein kinase 7 Cyclin-dependent kinase 7 (CDK7/cyclin H) P39 Mo15 TFIIH basal transcription factor complex kinase subunit
Type:
Enzyme Subunit
Mol. Mass.:
39047.01
Organism:
Homo sapiens (Human)
Description:
Residue:
346
  
Inhibitor
Name:
BDBM50378657
Synonyms:
CHEMBL1230607
Type:
Small organic molecule
Emp. Form.:
C19H31N5O2
Mol. Mass.:
361.4817
SMILES:
CC(C)CC(=O)Nc1[nH]nc2c1CN(C(=O)C1CCN(C)CC1)C2(C)C
: