Target
Potassium voltage-gated channel subfamily H member 2
Ligand
BDBM50386759
Substrate
Meas. Tech.
ChEMBL_826732 (CHEMBL2051179)
IC50
7860±n/a nM
Citation
 Cavalli, ABuonfiglio, RIanni, CMasetti, MCeccarini, LCaves, RChang, MWMitcheson, JSRoberti, MRecanatini, M Computational design and discovery of"minimally structured" hERG blockers. J Med Chem 55:4010-4 (2012)  
Target
Name:
Potassium voltage-gated channel subfamily H member 2
Synonyms:
1,3-beta-glucan synthase component GLS2 ERG Eag-related protein 1 Ether-a-go-go-related gene (HERG) Ether-a-go-go-related gene potassium channel 1 Ether-a-go-go-related gene potassium channel 1 (hERG1) Ether-a-go-go-related protein 1 H-ERG KCNH2 Potassium voltage-gated channel subfamily H member 2 (hERG) Voltage-gated potassium channel subunit Kv11.1 hERG Potassium Channel 1 | putative potassium channel subunit
Type:
Multi-pass membrane protein
Mol. Mass.:
126672.65
Organism:
Homo sapiens (Human)
Description:
Q12809
Residue:
1159
  
Inhibitor
Name:
BDBM50386759
Synonyms:
CHEMBL2046894
Type:
Small organic molecule
Emp. Form.:
C22H22N2O
Mol. Mass.:
330.4229
SMILES:
O=C(Cc1ccccc1)NCCN(c1ccccc1)c1ccccc1
: