Target
Histone lysine demethylase PHF8
Ligand
BDBM50395082
Substrate
Meas. Tech.
ChEMBL_859445 (CHEMBL2167523)
IC50
11500±n/a nM
Citation
 Rose, NRWoon, ECTumber, AWalport, LJChowdhury, RLi, XSKing, ONLejeune, CNg, SSKrojer, TChan, MCRydzik, AMHopkinson, RJChe, KHDaniel, MStrain-Damerell, CGileadi, CKochan, GLeung, IKDunford, JYeoh, KKRatcliffe, PJBurgess-Brown, Nvon Delft, FMuller, SMarsden, BBrennan, PEMcDonough, MAOppermann, UKlose, RJSchofield, CJKawamura, A Plant growth regulator daminozide is a selective inhibitor of human KDM2/7 histone demethylases. J Med Chem 55:6639-43 (2012)  
Target
Name:
Histone lysine demethylase PHF8
Synonyms:
Histone lysine demethylase PHF8 KIAA1111 PHD finger protein 8 PHF8_HUMAN | ZNF422
Type:
Protein
Mol. Mass.:
117889.91
Organism:
Homo sapiens (Human)
Description:
Q9UPP1
Residue:
1060
  
Inhibitor
Name:
BDBM50395082
Synonyms:
CHEMBL2164247
Type:
Small organic molecule
Emp. Form.:
C7H14N2O3
Mol. Mass.:
174.1977
SMILES:
CN(C)N(C)C(=O)CCC(O)=O
: