Target
Lysine-specific demethylase 2A
Ligand
BDBM50395083
Substrate
Meas. Tech.
ChEMBL_859444 (CHEMBL2167522)
IC50
250±n/a nM
Citation
 Rose, NRWoon, ECTumber, AWalport, LJChowdhury, RLi, XSKing, ONLejeune, CNg, SSKrojer, TChan, MCRydzik, AMHopkinson, RJChe, KHDaniel, MStrain-Damerell, CGileadi, CKochan, GLeung, IKDunford, JYeoh, KKRatcliffe, PJBurgess-Brown, Nvon Delft, FMuller, SMarsden, BBrennan, PEMcDonough, MAOppermann, UKlose, RJSchofield, CJKawamura, A Plant growth regulator daminozide is a selective inhibitor of human KDM2/7 histone demethylases. J Med Chem 55:6639-43 (2012)  
Target
Name:
Lysine-specific demethylase 2A
Synonyms:
AA1-1162 F-box and leucine-rich repeat protein 11 FBL7 Homo sapiens lysine demethylase 2A (KDM2A) KDM2A KIAA1004 Lysine-specific demethylase 2A (KDM2A) | NM_012308
Type:
Enzyme Catalytic Domain
Mol. Mass.:
132809.04
Organism:
Homo sapiens (Human)
Description:
Residue:
1162
  
Inhibitor
Name:
BDBM50395083
Synonyms:
CHEMBL2164246
Type:
Small organic molecule
Emp. Form.:
C4H8N2O3
Mol. Mass.:
132.1179
SMILES:
NNC(=O)CCC(O)=O
: