Target
Lysine-specific demethylase 4E
Ligand
BDBM50395078
Substrate
Meas. Tech.
ChEMBL_859441 (CHEMBL2167519)
IC50
4300±n/a nM
Citation
 Rose, NRWoon, ECTumber, AWalport, LJChowdhury, RLi, XSKing, ONLejeune, CNg, SSKrojer, TChan, MCRydzik, AMHopkinson, RJChe, KHDaniel, MStrain-Damerell, CGileadi, CKochan, GLeung, IKDunford, JYeoh, KKRatcliffe, PJBurgess-Brown, Nvon Delft, FMuller, SMarsden, BBrennan, PEMcDonough, MAOppermann, UKlose, RJSchofield, CJKawamura, A Plant growth regulator daminozide is a selective inhibitor of human KDM2/7 histone demethylases. J Med Chem 55:6639-43 (2012)  
Target
Name:
Lysine-specific demethylase 4E
Synonyms:
2-OG-Dependent Histone Demethylase JMJD2E Jumonji domain-containing protein 2E (JMJD2E) KDM4DL KDM4E_HUMAN Lysine-specific demethylase 4E | Lysine-specific demethylase 4E (KDM4E)
Type:
Enzyme
Mol. Mass.:
56815.71
Organism:
Homo sapiens (Human)
Description:
B2RXH2
Residue:
506
  
Inhibitor
Name:
BDBM50395078
Synonyms:
CHEMBL2164245
Type:
Small organic molecule
Emp. Form.:
C5H10N2O3
Mol. Mass.:
146.1445
SMILES:
CNNC(=O)CCC(O)=O
: