Target
Gastrin/cholecystokinin type B receptor
Ligand
BDBM50002900
Substrate
Meas. Tech.
ChEMBL_439002 (CHEMBL889348)
Ki
9.3±n/a nM
Citation
 McDonald, IMBlack, JWBuck, IMDunstone, DJGriffin, EPHarper, EAHull, RAKalindjian, SBLilley, EJLinney, IDPether, MJRoberts, SPShaxted, MESpencer, JSteel, KISykes, DAWalker, MKWatt, GFWright, LWright, PTXun, W Optimization of 1,3,4-benzotriazepine-based CCK(2) antagonists to obtain potent, orally active inhibitors of gastrin-mediated gastric acid secretion. J Med Chem 50:3101-12 (2007)  
Target
Name:
Gastrin/cholecystokinin type B receptor
Synonyms:
CCK-2 receptor CCK-BR CCKRB Cholecystokinin receptor GASR_HUMAN | Gastrin/cholecystokinin type B receptor
Type:
G Protein-Coupled Receptor (GPCR)
Mol. Mass.:
48445.79
Organism:
Homo sapiens (Human)
Description:
Stable expression of human CCK-2 receptors in HEK 293 cells.
Residue:
447
  
Inhibitor
Name:
BDBM50002900
Synonyms:
CHEMBL389933
Type:
Small organic molecule
Emp. Form.:
C31H36N6O5
Mol. Mass.:
572.6547
SMILES:
CC(C)(C)C(=O)CN1c2ccccc2C(=NN(CC(=O)Nc2ccc3n(CC(O)=O)ncc3c2)C1=O)C1CCCCC1
: