Target
Methionine aminopeptidase 1
Ligand
BDBM47468
Substrate
Meas. Tech.
ChEMBL_957175 (CHEMBL2378713)
EC50
940±n/a nM
Citation
 Zhang, FBhat, SGabelli, SBChen, XMiller, MSNacev, BACheng, YLMeyers, DJTenney, KShim, JSCrews, PAmzel, LMMa, DLiu, JO Pyridinylquinazolines selectively inhibit human methionine aminopeptidase-1 in cells. J Med Chem 56:3996-4016 (2013)  
Target
Name:
Methionine aminopeptidase 1
Synonyms:
Aminopeptidase MAP 1 METAP1 Methionine Aminopeptidase Type 1 (MetAP1) | Peptidase M 1
Type:
Enzyme
Mol. Mass.:
43220.79
Organism:
Homo sapiens (Human)
Description:
MetAP1 with an N-terminal six histidine tag was expressed in baculovirus infected sf9 cells.
Residue:
386
  
Inhibitor
Name:
BDBM47468
Synonyms:
MLS000769840 N-(2-phenylethyl)-2-pyridin-2-yl-quinazolin-4-amine Phenethyl-(2-pyridin-2-yl-quinazolin-4-yl)-amine cid_937982 | phenethyl-[2-(2-pyridyl)quinazolin-4-yl]amine
Type:
Small organic molecule
Emp. Form.:
C21H18N4
Mol. Mass.:
326.3944
SMILES:
C(Cc1ccccc1)Nc1nc(nc2ccccc12)-c1ccccn1
: