Target
Methionine aminopeptidase 1
Ligand
BDBM50433388
Substrate
Meas. Tech.
ChEMBL_957175 (CHEMBL2378713)
EC50
900±n/a nM
Citation
 Zhang, FBhat, SGabelli, SBChen, XMiller, MSNacev, BACheng, YLMeyers, DJTenney, KShim, JSCrews, PAmzel, LMMa, DLiu, JO Pyridinylquinazolines selectively inhibit human methionine aminopeptidase-1 in cells. J Med Chem 56:3996-4016 (2013)  
Target
Name:
Methionine aminopeptidase 1
Synonyms:
Aminopeptidase MAP 1 METAP1 Methionine Aminopeptidase Type 1 (MetAP1) | Peptidase M 1
Type:
Enzyme
Mol. Mass.:
43220.79
Organism:
Homo sapiens (Human)
Description:
MetAP1 with an N-terminal six histidine tag was expressed in baculovirus infected sf9 cells.
Residue:
386
  
Inhibitor
Name:
BDBM50433388
Synonyms:
CHEMBL2375617
Type:
Small organic molecule
Emp. Form.:
C25H22N4O2
Mol. Mass.:
410.4678
SMILES:
OC(=O)c1ccc(cc1)N1CCN(CC1)c1cc(nc2ccccc12)-c1ccccn1
: