Target
Tyrosine-protein phosphatase non-receptor type 2
Ligand
BDBM50444692
Substrate
Meas. Tech.
ChEMBL_1281643 (CHEMBL3102580)
IC50
4300±n/a nM
Citation
 Ottanà, RMaccari, RMortier, JCaselli, AAmuso, SCamici, GRotondo, AWolber, GPaoli, P Synthesis, biological activity and structure-activity relationships of new benzoic acid-based protein tyrosine phosphatase inhibitors endowed with insulinomimetic effects in mouse C2C12 skeletal muscle cells. Eur J Med Chem 71:112-27 (2014)  
Target
Name:
Tyrosine-protein phosphatase non-receptor type 2
Synonyms:
PTN2_HUMAN PTPT T-cell protein-tyrosine phosphatase TCPTP Tyrosine-protein phosphatase non-receptor type 2 (TC-PTP)
Type:
Protein
Mol. Mass.:
48481.80
Organism:
Homo sapiens (Human)
Description:
P17706
Residue:
415
  
Inhibitor
Name:
BDBM50444692
Synonyms:
CHEMBL3098853
Type:
Small organic molecule
Emp. Form.:
C33H28N2O5S
Mol. Mass.:
564.651
SMILES:
COc1ccc(\C=C2/S\C(=N/c3ccccc3)N(Cc3ccc(cc3)C(O)=O)C2=O)cc1OCCc1ccccc1
: