Target
Tyrosine-protein phosphatase non-receptor type 2
Ligand
BDBM50444702
Substrate
Meas. Tech.
ChEMBL_1281643 (CHEMBL3102580)
IC50
3500±n/a nM
Citation
 Ottanà, RMaccari, RMortier, JCaselli, AAmuso, SCamici, GRotondo, AWolber, GPaoli, P Synthesis, biological activity and structure-activity relationships of new benzoic acid-based protein tyrosine phosphatase inhibitors endowed with insulinomimetic effects in mouse C2C12 skeletal muscle cells. Eur J Med Chem 71:112-27 (2014)  
Target
Name:
Tyrosine-protein phosphatase non-receptor type 2
Synonyms:
PTN2_HUMAN PTPT T-cell protein-tyrosine phosphatase TCPTP Tyrosine-protein phosphatase non-receptor type 2 (TC-PTP)
Type:
Protein
Mol. Mass.:
48481.80
Organism:
Homo sapiens (Human)
Description:
P17706
Residue:
415
  
Inhibitor
Name:
BDBM50444702
Synonyms:
CHEMBL3098946
Type:
Small organic molecule
Emp. Form.:
C26H21NO6S
Mol. Mass.:
475.513
SMILES:
COc1cc(\C=C2/SC(=O)N(Cc3ccc(cc3)C(O)=O)C2=O)ccc1OCc1ccccc1
: