Target
Tyrosine-protein phosphatase non-receptor type 1
Ligand
BDBM50444704
Substrate
Meas. Tech.
ChEMBL_1281645 (CHEMBL3102582)
IC50
24600±n/a nM
Citation
 Ottanà, RMaccari, RMortier, JCaselli, AAmuso, SCamici, GRotondo, AWolber, GPaoli, P Synthesis, biological activity and structure-activity relationships of new benzoic acid-based protein tyrosine phosphatase inhibitors endowed with insulinomimetic effects in mouse C2C12 skeletal muscle cells. Eur J Med Chem 71:112-27 (2014)  
Target
Name:
Tyrosine-protein phosphatase non-receptor type 1
Synonyms:
PTN1_HUMAN PTPN1 Protein tyrosine phosphatase-1B (PTP1B) Protein-tyrosine phosphatase 1B (PTP1B) Tyrosine-protein phosphatase non-receptor type 1 (PTP1B)
Type:
Protein phosphatase
Mol. Mass.:
49963.76
Organism:
Homo sapiens (Human)
Description:
Human recombinant GST-fusion PTP1B (1-435).
Residue:
435
  
Inhibitor
Name:
BDBM50444704
Synonyms:
CHEMBL3098943
Type:
Small organic molecule
Emp. Form.:
C27H23NO6S
Mol. Mass.:
489.54
SMILES:
COc1ccc(\C=C2/SC(=O)N(Cc3ccc(cc3)C(O)=O)C2=O)cc1OCCc1ccccc1
: