Target
Cytochrome P450 2C9
Ligand
BDBM50012905
Substrate
Meas. Tech.
ChEMBL_1351972 (CHEMBL3266609)
IC50
22000±n/a nM
Citation
 Kelly, MJPietranico-Cole, SLarigan, JDHaynes, NEReynolds, CHScott, NVermeulen, JDvorozniak, MConde-Knape, KHuang, KSSo, SSThakkar, KQian, YBanner, BMennona, FDanzi, SKlein, ITaub, RTilley, J Discovery of 2-[3,5-dichloro-4-(5-isopropyl-6-oxo-1,6-dihydropyridazin-3-yloxy)phenyl]-3,5-dioxo-2,3,4,5-tetrahydro[1,2,4]triazine-6-carbonitrile (MGL-3196), a Highly Selective Thyroid Hormone Receptorß agonist in clinical trials for the treatment of dyslipidemia. J Med Chem 57:3912-23 (2014)  
Target
Name:
Cytochrome P450 2C9
Synonyms:
(R)-limonene 6-monooxygenase CP2C9_HUMAN CYP2C9 Cytochrome P450 2C9 (CYP2C9 ) P-450MP P450 PB-1 | S-mephenytoin 4-hydroxylase
Type:
Enzyme
Mol. Mass.:
55636.33
Organism:
Homo sapiens (Human)
Description:
P11712
Residue:
490
  
Inhibitor
Name:
BDBM50012905
Synonyms:
CHEMBL3261331 | USRE46024, 8
Type:
Small organic molecule
Emp. Form.:
C17H12Cl2N6O4
Mol. Mass.:
435.221
SMILES:
CC(C)c1cc(Oc2c(Cl)cc(cc2Cl)-n2nc(C#N)c(=O)[nH]c2=O)n[nH]c1=O
: