Target
Nuclear factor erythroid 2-related factor 2
Ligand
BDBM50006932
Substrate
Meas. Tech.
ChEMBL_1509260 (CHEMBL3602923)
IC50
31±n/a nM
Citation
 Jiang, ZYXu, LLLu, MCChen, ZYYuan, ZWXu, XLGuo, XKZhang, XJSun, HPYou, QD Structure-Activity and Structure-Property Relationship and Exploratory in Vivo Evaluation of the Nanomolar Keap1-Nrf2 Protein-Protein Interaction Inhibitor. J Med Chem 58:6410-21 (2015)  
Target
Name:
Nuclear factor erythroid 2-related factor 2
Synonyms:
HEBP1 NF-E2-related factor 2 NFE2-related factor 2 NRF2 Nuclear factor, erythroid derived 2, like 2
Type:
PROTEIN
Mol. Mass.:
67786.89
Organism:
Homo sapiens (Human)
Description:
ChEMBL_107924
Residue:
605
  
Inhibitor
Name:
BDBM50006932
Synonyms:
CHEMBL3237245
Type:
Small organic molecule
Emp. Form.:
C28H26N2O10S2
Mol. Mass.:
614.643
SMILES:
COc1ccc(cc1)S(=O)(=O)N(CC(O)=O)c1ccc(N(CC(O)=O)S(=O)(=O)c2ccc(OC)cc2)c2ccccc12
: