Target
Acid ceramidase
Ligand
BDBM50151154
Substrate
Meas. Tech.
ChEBML_1558880
IC50
390±n/a nM
Citation
 Nuzzi, AFiasella, AOrtega, JAPagliuca, CPonzano, SPizzirani, DBertozzi, SMOttonello, GTarozzo, GReggiani, ABandiera, TBertozzi, FPiomelli, D Potenta-amino-ß-lactam carbamic acid ester as NAAA inhibitors. Synthesis and structure-activity relationship (SAR) studies. Eur J Med Chem 111:138-59 (2016)  
Target
Name:
Acid ceramidase
Synonyms:
ASAH ASAH1_HUMAN Acid ceramidase (AC)
Type:
Enzyme
Mol. Mass.:
44662.65
Organism:
Homo sapiens (Human)
Description:
Q13510
Residue:
395
  
Inhibitor
Name:
BDBM50151154
Synonyms:
CHEMBL3770896
Type:
Small organic molecule
Emp. Form.:
C15H20N2O3
Mol. Mass.:
276.3309
SMILES:
CCCCc1ccc(COC(=O)N[C@H]2CNC2=O)cc1
: