Target
Microtubule-associated protein 2
Ligand
BDBM50167910
Substrate
Meas. Tech.
ChEMBL_1574297 (CHEMBL3802682)
IC50
62±n/a nM
Citation
 Cheruvallath, ZTang, MMcBride, CKomandla, MMiura, JTon-Nu, TErikson, PFeng, JFarrell, PLawson, JDVanderpool, DWu, YDougan, DRPlonowski, AHolub, CLarson, C Discovery of potent, reversible MetAP2 inhibitors via fragment based drug discovery and structure based drug design-Part 1. Bioorg Med Chem Lett 26:2774-2778 (2016)  
Target
Name:
Microtubule-associated protein 2
Synonyms:
MAP-2 MTAP2_HUMAN
Type:
PROTEIN
Mol. Mass.:
199423.64
Organism:
Homo sapiens (Human)
Description:
ChEMBL_107603
Residue:
1827
  
Inhibitor
Name:
BDBM50167910
Synonyms:
CHEMBL3798100
Type:
Small organic molecule
Emp. Form.:
C14H9N3
Mol. Mass.:
219.2414
SMILES:
N#Cc1cc(-c2ccccc2)c2cn[nH]c2c1
: