Target
Histone deacetylase 3
Ligand
BDBM50189903
Substrate
Meas. Tech.
ChEMBL_1591003 (CHEMBL3830981)
IC50
1090±n/a nM
Citation
 Wagner, FFWeïwer, MSteinbacher, SSchomburg, AReinemer, PGale, JPCampbell, AJFisher, SLZhao, WNReis, SAHennig, KMThomas, MMüller, PJefson, MRFass, DMHaggarty, SJZhang, YLHolson, EB Kinetic and structural insights into the binding of histone deacetylase 1 and 2 (HDAC1, 2) inhibitors. Bioorg Med Chem 24:4008-4015 (2016)  
Target
Name:
Histone deacetylase 3
Synonyms:
HD3 HDAC3_HUMAN Human HDAC3 SMAP45
Type:
Enzyme
Mol. Mass.:
48829.55
Organism:
Homo sapiens (Human)
Description:
O15379
Residue:
428
  
Inhibitor
Name:
BDBM50189903
Synonyms:
CHEMBL3828396 | US11572368, Compound 54
Type:
Small organic molecule
Emp. Form.:
C18H19FN2O2
Mol. Mass.:
314.3541
SMILES:
Nc1ccc(cc1NC(=O)C1CCOCC1)-c1ccc(F)cc1
: