Target
Oxysterols receptor LXR-beta
Ligand
BDBM50192760
Substrate
Meas. Tech.
ChEMBL_1613606 (CHEMBL3855406)
Ki
13±n/a nM
Citation
 Tice, CMNoto, PBFan, KYZhao, WLotesta, SDDong, CMarcus, APZheng, YJChen, GWu, ZVan Orden, RZhou, JBukhtiyarov, YZhao, YLipinski, KHoward, LGuo, JKandpal, GMeng, SHardy, AKrosky, PGregg, RELeftheris, KMcKeever, BMSingh, SBLala, DMcGeehan, GMZhuang, LClaremon, DA Brain penetrant liver X receptor (LXR) modulators based on a 2,4,5,6-tetrahydropyrrolo[3,4-c]pyrazole core. Bioorg Med Chem Lett 26:5044-5050 (2016)  
Target
Name:
Oxysterols receptor LXR-beta
Synonyms:
LXRB Liver X, LXR beta NR1H2 Nuclear receptor NER Ubiquitously-expressed nuclear receptor
Type:
Enzyme Catalytic Domain
Mol. Mass.:
50978.79
Organism:
Homo sapiens (Human)
Description:
P55055
Residue:
460
  
Inhibitor
Name:
BDBM50192760
Synonyms:
CHEMBL3972392
Type:
Small organic molecule
Emp. Form.:
C20H22FN5O3S
Mol. Mass.:
431.484
SMILES:
COc1ncc(F)c(n1)N1Cc2cn(nc2[C@H]1C(C)C)-c1cccc(c1)S(C)(=O)=O
: