Target
Thymidine kinase
Ligand
BDBM50013082
Substrate
Meas. Tech.
ChEMBL_208025 (CHEMBL814153)
IC50
25119±n/a nM
Citation
 Gambino, JFocher, FHildebrand, CMaga, GNoonan, TSpadari, SWright, G Quantitative structure-activity relationships of N2-phenylguanines as inhibitors of herpes simplex virus thymidine kinases. J Med Chem 35:2979-83 (1992)  
Target
Name:
Thymidine kinase
Synonyms:
KITH_HHV1S Thymidine kinase | UL23
Type:
PROTEIN
Mol. Mass.:
40883.42
Organism:
Human herpesvirus 1 (strain SC16) (HHV-1) (Human herpes simplex virus1)
Description:
ChEMBL_213
Residue:
376
  
Inhibitor
Name:
BDBM50013082
Synonyms:
2-(3-Hydroxymethyl-phenylamino)-1,9-dihydro-purin-6-one | CHEMBL293668
Type:
Small organic molecule
Emp. Form.:
C12H11N5O2
Mol. Mass.:
257.248
SMILES:
OCc1cccc(Nc2nc3nc[nH]c3c(=O)[nH]2)c1
: