Target
Thymidine kinase
Ligand
BDBM50229864
Substrate
Meas. Tech.
ChEMBL_208025 (CHEMBL814153)
IC50
39811±n/a nM
Citation
 Gambino, JFocher, FHildebrand, CMaga, GNoonan, TSpadari, SWright, G Quantitative structure-activity relationships of N2-phenylguanines as inhibitors of herpes simplex virus thymidine kinases. J Med Chem 35:2979-83 (1992)  
Target
Name:
Thymidine kinase
Synonyms:
KITH_HHV1S Thymidine kinase | UL23
Type:
PROTEIN
Mol. Mass.:
40883.42
Organism:
Human herpesvirus 1 (strain SC16) (HHV-1) (Human herpes simplex virus1)
Description:
ChEMBL_213
Residue:
376
  
Inhibitor
Name:
BDBM50229864
Synonyms:
CHEMBL420269
Type:
Small organic molecule
Emp. Form.:
C11H8IN5O
Mol. Mass.:
353.1186
SMILES:
Oc1[nH]c(Nc2ccc(I)cc2)nc2ncnc12
: