Target
Alpha-glucosidase MAL12
Ligand
BDBM18351
Substrate
Meas. Tech.
Inhibition Assay
Ki
1.80e+4± 1.2e+3 nM
IC50
3.95e+4± 5e+2 nM
Citation
 Kim, JYLee, JWKim, YSLee, YRyu, YBKim, SRyu, HWCurtis-Long, MJLee, KWLee, WSPark, KH A novel competitive class of α-glucosidase inhibitors: (E)-1-phenyl-3-(4-styrylphenyl)urea derivatives. Chembiochem 11:2125-31 (2010)  
Target
Name:
Alpha-glucosidase MAL12
Synonyms:
α-Glucosidase MAL12_YEAST Maltase | alpha-Glucosidase (α-Glucosidase)
Type:
Protein
Mol. Mass.:
68084.32
Organism:
Saccharomyces cerevisiae
Description:
P53341
Residue:
584
  
Inhibitor
Name:
BDBM18351
Synonyms:
(2R,3R,4R,5S)-2-(Hydroxymethyl)piperidine-3,4,5-triol, 10 1-Deoxynojirimycin CHEMBL307429 US9181184, 1 | dNM
Type:
natural product
Emp. Form.:
C6H13NO4
Mol. Mass.:
163.1717
SMILES:
OC[C@H]1NC[C@H](O)[C@@H](O)[C@@H]1O
: