Target
Acyl-protein thioesterase 2
Ligand
BDBM92720
Substrate
Meas. Tech.
Enzymatic Protein Activity Assay
IC50
4.1e+3± 3e+1 nM
Citation
 Zimmermann, TJBürger, MTashiro, EKondoh, YMartinez, NEGörmer, KRosin-Steiner, SShimizu, TOzaki, SMikoshiba, KWatanabe, NHall, DVetter, IROsada, HHedberg, CWaldmann, H Boron-based inhibitors of acyl protein thioesterases 1 and 2. Chembiochem 14:115-22 (2013)  
Target
Name:
Acyl-protein thioesterase 2
Synonyms:
APT2 LYPA2_HUMAN Lysophospholipase II
Type:
Protein
Mol. Mass.:
24740.23
Organism:
Homo sapiens (Human)
Description:
O95372
Residue:
231
  
Inhibitor
Name:
BDBM92720
Synonyms:
Phenylboronic acid, 13
Type:
Small molecule
Emp. Form.:
C30H34B2N2O3
Mol. Mass.:
492.225
SMILES:
NCCOB(c1ccccc1)c1ccc(COCc2ccc(cc2)B(OCCN)c2ccccc2)cc1
: