Target
Fatty acid synthase
Ligand
BDBM128359
Substrate
Meas. Tech.
Biological Assay
pH
7±n/a
IC50
6±n/a nM
Comments
extracted
Citation
 Adams, NDAquino, CJChaudhari, AMGhergurovich, JMKiesow, TJParrish, CAReif, AJWiggall, K Triazolones as fatty acid synthase inhibitors US Patent  US8802864 Publication Date 8/12/2014 
Target
Name:
Fatty acid synthase
Synonyms:
FAS FAS_HUMAN HU FASN
Type:
Enzyme
Mol. Mass.:
273419.37
Organism:
Homo sapiens (Human)
Description:
P49327
Residue:
2511
  
Inhibitor
Name:
BDBM128359
Synonyms:
US8802864, 14
Type:
Small organic molecule
Emp. Form.:
C25H24N4O3
Mol. Mass.:
428.4831
SMILES:
O=C(C1CC1)N1CC[C@@H](Cc2n[nH]c(=O)n2-c2ccc(cc2)-c2ccc3ccoc3c2)C1
: