Target
Metabotropic glutamate receptor 5
Ligand
BDBM141506
Substrate
Meas. Tech.
Calcium Mobilization Assay
pH
7.4±n/a
Temperature
310.15±n/a K
IC50
3.9±n/a nM
Comments
extracted
Citation
 Li, GZhou, HWeiss, JDoller, DBurns, JF Bicyclo[3.2.1]octyl amide derivatives and uses of same US Patent  US8921370 Publication Date 12/30/2014 
Target
Name:
Metabotropic glutamate receptor 5
Synonyms:
GPRC1E GRM5_HUMAN metabotropic glutamate 5 | metabotropic glutamate 5a
Type:
Enzyme
Mol. Mass.:
132484.72
Organism:
Homo sapiens (Human)
Description:
Residue:
1212
  
Inhibitor
Name:
BDBM141506
Synonyms:
US8921370, 160 | US9656975, 160
Type:
Small organic molecule
Emp. Form.:
C21H23FN4O2
Mol. Mass.:
382.4313
SMILES:
Cc1cncc(n1)C(=O)N[C@]12CC[C@](C1)(CCC2)NC(=O)c1cccc(F)c1
: