Target
Isocitrate dehydrogenase [NADP], mitochondrial
Ligand
BDBM195602
Substrate
Meas. Tech.
Diaphorase/Resazurin Coupled Assay
Temperature
298.15±n/a K
IC50
>100000±0.0 nM
Comments
extracted
Target
Name:
Isocitrate dehydrogenase [NADP], mitochondrial
Synonyms:
IDH2 IDHP_HUMAN | Isocitrate dehydrogenase 2 (IDH2)
Type:
Protein
Mol. Mass.:
50923.31
Organism:
Homo sapiens (Human)
Description:
Full-length wild-type
Residue:
452
  
Inhibitor
Name:
BDBM195602
Synonyms:
GSK990
Type:
Small organic molecule
Emp. Form.:
C23H23N7O2
Mol. Mass.:
429.4744
SMILES:
Cc1cccc(NC(=O)c2nn(Cc3c[nH]cn3)c3CCN(Cc23)C(=O)c2ccc[nH]2)c1
: