Target
Replicase polyprotein 1ab
Ligand
BDBM496557
Substrate
Meas. Tech.
PLpro Primary Assay
IC50
1600±n/a nM
Citation
 Shen, ZRatia, KCooper, LKong, DLee, HKwon, YLi, YAlqarni, SHuang, FDubrovskyi, ORong, LThatcher, GRJXiong, R Design of SARS-CoV-2 PLpro Inhibitors for COVID-19 Antiviral Therapy Leveraging Binding Cooperativity. J Med Chem 0:0 (2021)  
Target
Name:
Replicase polyprotein 1ab
Synonyms:
ORF1ab polyprotein pp1ab | rep
Type:
Protein
Mol. Mass.:
794070.71
Organism:
2019-nCoV
Description:
P0DTD1
Residue:
7096
  
Inhibitor
Name:
BDBM496557
Synonyms:
SARS-CoV-2 PLpro Inhibitor, 10
Type:
Small Organic Molecule
Emp. Form.:
C25H29N3O
Mol. Mass.:
387.5173
SMILES:
C[C@@H](NC(=O)c1cc(ccc1C)N(C)C1CN(C)C1)c1cccc2ccccc12
: