Target
Replicase polyprotein 1ab
Ligand
BDBM496586
Substrate
Meas. Tech.
Secondary Binding Analysis by Surface Plasmon Resonance
Kd
26500±n/a nM
Citation
 Shen, ZRatia, KCooper, LKong, DLee, HKwon, YLi, YAlqarni, SHuang, FDubrovskyi, ORong, LThatcher, GRJXiong, R Design of SARS-CoV-2 PLpro Inhibitors for COVID-19 Antiviral Therapy Leveraging Binding Cooperativity. J Med Chem 0:0 (2021)  
Target
Name:
Replicase polyprotein 1ab
Synonyms:
ORF1ab polyprotein pp1ab | rep
Type:
Protein
Mol. Mass.:
794070.71
Organism:
2019-nCoV
Description:
P0DTD1
Residue:
7096
  
Inhibitor
Name:
BDBM496586
Synonyms:
SARS-CoV-2 PLpro Inhibitor, 13
Type:
Small Organic Molecule
Emp. Form.:
C23H24N2O3
Mol. Mass.:
376.4483
SMILES:
C[C@@H](NC(=O)c1cc(CNCC(O)=O)ccc1C)c1cccc2ccccc12
: