Target
Replicase polyprotein 1ab
Ligand
BDBM496812
Substrate
Meas. Tech.
Secondary Binding Analysis by Surface Plasmon Resonance
Kd
186000±n/a nM
Citation
 Shen, ZRatia, KCooper, LKong, DLee, HKwon, YLi, YAlqarni, SHuang, FDubrovskyi, ORong, LThatcher, GRJXiong, R Design of SARS-CoV-2 PLpro Inhibitors for COVID-19 Antiviral Therapy Leveraging Binding Cooperativity. J Med Chem 0:0 (2021)  
Target
Name:
Replicase polyprotein 1ab
Synonyms:
ORF1ab polyprotein pp1ab | rep
Type:
Protein
Mol. Mass.:
794070.71
Organism:
2019-nCoV
Description:
P0DTD1
Residue:
7096
  
Inhibitor
Name:
BDBM496812
Synonyms:
SARS-CoV-2 PLpro Inhibitor, 42
Type:
Small Organic Molecule
Emp. Form.:
C24H27N3O2
Mol. Mass.:
389.4901
SMILES:
CN(C1CNC1)c1ccc(C)c(c1)C(=O)NC(CO)c1cccc2ccccc12
: