Target
Replicase polyprotein 1ab
Ligand
BDBM496842
Substrate
Meas. Tech.
PLpro Primary Assay
IC50
390±n/a nM
Citation
 Shen, ZRatia, KCooper, LKong, DLee, HKwon, YLi, YAlqarni, SHuang, FDubrovskyi, ORong, LThatcher, GRJXiong, R Design of SARS-CoV-2 PLpro Inhibitors for COVID-19 Antiviral Therapy Leveraging Binding Cooperativity. J Med Chem 0:0 (2021)  
Target
Name:
Replicase polyprotein 1ab
Synonyms:
ORF1ab polyprotein pp1ab | rep
Type:
Protein
Mol. Mass.:
794070.71
Organism:
2019-nCoV
Description:
P0DTD1
Residue:
7096
  
Inhibitor
Name:
BDBM496842
Synonyms:
SARS-CoV-2 PLpro Inhibitor, 72
Type:
Small Organic Molecule
Emp. Form.:
C29H36N4OS
Mol. Mass.:
488.687
SMILES:
C[C@@H](NC(=O)c1cc(NC2CNC2)ccc1C)c1cccc(c1)-c1ccc(CNC2CCCC2)s1
: