Target
Bromodomain-containing protein 2 [74-94]
Ligand
BDBM50452557
Substrate
Meas. Tech.
Isothermal Titration Calorimetry Analysis of Binding to Brd2-BD1 and Brd2-BD2
Kd
92±n/a nM
Citation
 Guy, RKSlavish, PJShadrick, WRYoung, BMBoyd, VABharatham, NPrice, JEShelat, A Tetrahydroquinoline-based bromodomain inhibitors US Patent  US11028051 Publication Date 6/8/2021 
Target
Name:
Bromodomain-containing protein 2 [74-94]
Synonyms:
BRD2 BRD2_HUMAN KIAA9001 | RING3
Type:
Mol. Mass.:
2626.15
Organism:
Homo sapiens (Human)
Description:
P25440[74-94]
Residue:
21
  
Inhibitor
Name:
BDBM50452557
Synonyms:
CHEMBL4206677 | US11028051, Cmpd 55
Type:
Small organic molecule
Emp. Form.:
C20H25N3O3
Mol. Mass.:
355.4308
SMILES:
CC(C)OC(=O)N[C@@H]1C[C@H](C)N(C(C)=O)c2ccc(cc12)-c1cc[nH]c1
: