Target
Sentrin-specific protease/Small ubiquitin-related modifier 1
Ligand
BDBM103826
Substrate
Meas. Tech.
Enzyme Kinetic Assay
IC50
32800±1820 nM
Citation
 Chen, YChen, CNamanja, A Methods of identifying SENP1 inhibitors US Patent  US11041859 Publication Date 6/22/2021 
Target
Name:
Sentrin-specific protease/Small ubiquitin-related modifier 1
Synonyms:
SUMO1/SENP1
Type:
Protein
Mol. Mass.:
Description:
Components:
This complex has 2 components.
Component 1
Name:
Small ubiquitin-related modifier 1
Synonyms:
SMT3C SUMO1 Small ubiquitin-related modifier 1 | UBL1
Type:
Protein
Mol. Mass.:
11553.84
Organism:
Homo sapiens (Human)
Description:
Residue:
101
  
Component 2
Name:
Sentrin-specific protease 1
Synonyms:
SENP1 Sentrin-specific protease 1 (SENP1)
Type:
Protein
Mol. Mass.:
73500.42
Organism:
Homo sapiens (Human)
Description:
Q9P0U3
Residue:
644
  
Inhibitor
Name:
BDBM103826
Synonyms:
SPI-01 US9791447, Compound SPI-01
Type:
Small organic molecule
Emp. Form.:
C34H26N6O6S2
Mol. Mass.:
678.737
SMILES:
Nc1ccc2ccccc2c1\N=N\c1ccc(\C=C\c2ccc(cc2S(O)(=O)=O)\N=N\c2c(N)ccc3ccccc23)c(c1)S(O)(=O)=O
: