BDBM116257 US10035794, Example 34::US10683287, Example 34::US8637508, 34
SMILES C[C@]1(CO[C@](C)(C(N)=N1)C(F)(F)F)c1nc(NC(=O)c2ncc(cc2Cl)C(F)(F)F)ccc1F
InChI Key InChIKey=PSBBWFNMHDUTRH-DLBZAZTESA-N
Data  27 IC50
PDB links: 1 PDB ID matches this monomer.
  Tab Delimited (TSV)   2D SDfile   Computed 3D by Vconf -m prep SDfile
Find this compound or compounds like it in BindingDB:
Activity Spreadsheet -- Enzyme Inhibition Constant Data from BindingDB
Found 27 hits for monomerid = 116257
TargetBeta-secretase 1(Homo sapiens (Human))
Novartis
US Patent
LigandPNGBDBM116257(US10035794, Example 34 | US10683287, Example 34 | ...)
Affinity DataIC50:  7nMpH: 4.5 T: 2°C. Assay description: Recombinant BACE-1 (extracellular domain, expressed in baculovirus and purified using standard methods) at 0.1 to 10 nM concentrations is incubated w...
TargetAmyloid-beta precursor protein(Homo sapiens (Human))
Novartis Pharma
Curated by ChEMBL
LigandPNGBDBM116257(US10035794, Example 34 | US10683287, Example 34 | ...)
Affinity DataIC50:  3nM. Assay description: Inhibition of wild type human APP751 expressed in CHO cells assessed as reduction in amyloid beta(1 to 40 residues) level
In DepthDetails ArticlePubMed
TargetBeta-secretase 1(Homo sapiens (Human))
Novartis
US Patent
LigandPNGBDBM116257(US10035794, Example 34 | US10683287, Example 34 | ...)
Affinity DataIC50:  7nMpH: 4.5 T: 2°C. Assay description: Recombinant BACE-1 (extracellular domain, expressed in baculovirus and purified using standard methods) at 0.1 to 10 nM concentrations is incubated w...
TargetBeta-secretase 2(Homo sapiens (Human))
Novartis
US Patent
LigandPNGBDBM116257(US10035794, Example 34 | US10683287, Example 34 | ...)
Affinity DataIC50:  30nMpH: 4.5 T: 2°C. Assay description: Recombinant BACE-2 (extracellular domain, expressed in baculovirus and purified using standard methods) at 0.1 to 10 nM concentrations is incubated w...
In DepthDetails US Patent
TargetIsocitrate dehydrogenase [NADP] cytoplasmic [R132H](Homo sapiens (Human))
Novartis
US Patent
LigandPNGBDBM116257(US10035794, Example 34 | US10683287, Example 34 | ...)
Affinity DataIC50:  3nM. Assay description: Chinese hamster ovary cells are transfected with the human gene for amyloid precursor protein. The cells are plated at a density of 8000 cells/well i...
In DepthDetails US Patent
TargetBeta-secretase 1(Homo sapiens (Human))
Novartis
US Patent
LigandPNGBDBM116257(US10035794, Example 34 | US10683287, Example 34 | ...)
Affinity DataIC50:  7nM. Assay description: Recombinant BACE-1 (extracellular domain, expressed in baculovirus and purified using standard methods) at 0.1 to 10 nM concentrations is incubated w...
TargetBeta-secretase 2(Homo sapiens (Human))
Novartis
US Patent
LigandPNGBDBM116257(US10035794, Example 34 | US10683287, Example 34 | ...)
Affinity DataIC50:  30nM. Assay description: Recombinant BACE-2 (extracellular domain, expressed in baculovirus and purified using standard methods) at 0.1 to 10 nM concentrations is incubated w...
In DepthDetails US Patent
TargetBeta-secretase 2(Homo sapiens (Human))
Novartis
US Patent
LigandPNGBDBM116257(US10035794, Example 34 | US10683287, Example 34 | ...)
Affinity DataIC50:  30nM. Assay description: Inhibition of human BACE2 by FRET assay
In DepthDetails ArticlePubMed
TargetBeta-secretase 1(Cricetulus griseus)
Janssen Research & Development
Curated by ChEMBL
LigandPNGBDBM116257(US10035794, Example 34 | US10683287, Example 34 | ...)
Affinity DataIC50:  3nM. Assay description: Inhibition of BACE1 in CHO cells expressing human APP assessed as reduction in amyloidbeta (1 to 40 residues) level incubated for 24 hrs by immunoass...
TargetBeta-secretase 1(Homo sapiens (Human))
Novartis
US Patent
LigandPNGBDBM116257(US10035794, Example 34 | US10683287, Example 34 | ...)
Affinity DataIC50:  11nM. Assay description: Inhibition of human BACE1 by FRET assay
TargetBeta-secretase 1(Homo sapiens (Human))
Novartis
US Patent
LigandPNGBDBM116257(US10035794, Example 34 | US10683287, Example 34 | ...)
Affinity DataIC50:  11nM. Assay description: Inhibition of human recombinant BACE1 catalytic domain using FRET substrate with BACE-cleavable sequence
TargetBeta-secretase 2(Homo sapiens (Human))
Novartis
US Patent
LigandPNGBDBM116257(US10035794, Example 34 | US10683287, Example 34 | ...)
Affinity DataIC50:  30nM. Assay description: Inhibition of human recombinant BACE2 catalytic domain using FRET substrate with BACE-cleavable sequence
In DepthDetails ArticlePubMed
TargetCathepsin D(Homo sapiens (Human))
Novartis Pharma
Curated by ChEMBL
LigandPNGBDBM116257(US10035794, Example 34 | US10683287, Example 34 | ...)
Affinity DataIC50:  2.05E+5nM. Assay description: Inhibition of human Cathepsin D using Mca-GKPILFFRLK(DNP)D-R-NH2 as a substrate
In DepthDetails ArticlePubMed
TargetCathepsin E(Homo sapiens (Human))
Novartis Pharma
Curated by ChEMBL
LigandPNGBDBM116257(US10035794, Example 34 | US10683287, Example 34 | ...)
Affinity DataIC50:  6.64E+4nM. Assay description: Inhibition of human Cathepsin E using Mca-GKPILFFRLK(DNP)D-R-NH2 as a substrate
In DepthDetails ArticlePubMed
TargetAmyloid-beta precursor protein(Homo sapiens (Human))
Novartis Pharma
Curated by ChEMBL
LigandPNGBDBM116257(US10035794, Example 34 | US10683287, Example 34 | ...)
Affinity DataIC50:  3nM. Assay description: Inhibition of wild type APP751 (unknown origin) expressed in CHO cells
In DepthDetails ArticlePubMed
TargetPotassium voltage-gated channel subfamily H member 2(Homo sapiens (Human))
Novartis Pharma
Curated by ChEMBL
LigandPNGBDBM116257(US10035794, Example 34 | US10683287, Example 34 | ...)
Affinity DataIC50:  3.20E+3nM. Assay description: Binding affinity to human ERG
In DepthDetails ArticlePubMed
TargetCytochrome P450 3A4(Homo sapiens (Human))
Novartis Pharma
Curated by ChEMBL
LigandPNGBDBM116257(US10035794, Example 34 | US10683287, Example 34 | ...)
Affinity DataIC50:  1.09E+4nM. Assay description: Irreversible inhibition of CYP3A4 in human liver microsomes incubated for 10 mins in presence of NADPH by mass spectrometry
In DepthDetails ArticlePubMed
TargetCytochrome P450 2D6(Homo sapiens (Human))
Novartis Pharma
Curated by ChEMBL
LigandPNGBDBM116257(US10035794, Example 34 | US10683287, Example 34 | ...)
Affinity DataIC50:  1.34E+4nM. Assay description: Irreversible inhibition of CYP2D6 in human liver microsomes incubated for 10 mins in presence of NADPH by mass spectrometry
In DepthDetails ArticlePubMed
TargetPotassium voltage-gated channel subfamily H member 2(Homo sapiens (Human))
Novartis Pharma
Curated by ChEMBL
LigandPNGBDBM116257(US10035794, Example 34 | US10683287, Example 34 | ...)
Affinity DataIC50: >1.00E+4nM. Assay description: Inhibition of human ERG by manual patch clamp assay
In DepthDetails ArticlePubMed
TargetAmyloid-beta precursor protein(Homo sapiens (Human))
Novartis Pharma
Curated by ChEMBL
LigandPNGBDBM116257(US10035794, Example 34 | US10683287, Example 34 | ...)
Affinity DataIC50:  3nM. Assay description: Inhibition of wild type human APP751 expressed in CHO cells assessed as reduction in amyloid beta42 level
In DepthDetails ArticlePubMed
TargetAmyloid-beta precursor protein(Homo sapiens (Human))
Novartis Pharma
Curated by ChEMBL
LigandPNGBDBM116257(US10035794, Example 34 | US10683287, Example 34 | ...)
Affinity DataIC50:  4nM. Assay description: Inhibition of wild type human APP751 expressed in CHO cells assessed as reduction in amyloid beta40 level
In DepthDetails ArticlePubMed
TargetCytochrome P450 2C9(Homo sapiens (Human))
Novartis Pharma
Curated by ChEMBL
LigandPNGBDBM116257(US10035794, Example 34 | US10683287, Example 34 | ...)
Affinity DataIC50: >2.00E+4nM. Assay description: Irreversible inhibition of CYP2C9 in human liver microsomes incubated for 10 mins in presence of NADPH by mass spectrometry
In DepthDetails ArticlePubMed
TargetBeta-secretase 1(Homo sapiens (Human))
Novartis
US Patent
LigandPNGBDBM116257(US10035794, Example 34 | US10683287, Example 34 | ...)
Affinity DataIC50:  11nM. Assay description: Inhibition of human BACE1
TargetBeta-secretase 2(Homo sapiens (Human))
Novartis
US Patent
LigandPNGBDBM116257(US10035794, Example 34 | US10683287, Example 34 | ...)
Affinity DataIC50:  30nM. Assay description: Inhibition of human BACE2
In DepthDetails ArticlePubMed
TargetCathepsin D(Homo sapiens (Human))
Novartis Pharma
Curated by ChEMBL
LigandPNGBDBM116257(US10035794, Example 34 | US10683287, Example 34 | ...)
Affinity DataIC50:  2.05E+5nM. Assay description: Inhibition of human cathepsin D
In DepthDetails ArticlePubMed
TargetCathepsin E(Homo sapiens (Human))
Novartis Pharma
Curated by ChEMBL
LigandPNGBDBM116257(US10035794, Example 34 | US10683287, Example 34 | ...)
Affinity DataIC50:  6.64E+4nM. Assay description: Inhibition of human cathepsin E
In DepthDetails ArticlePubMed
TargetBeta-secretase 2(Homo sapiens (Human))
Novartis
US Patent
LigandPNGBDBM116257(US10035794, Example 34 | US10683287, Example 34 | ...)
Affinity DataIC50:  30nMpH: 4.5 T: 2°C. Assay description: Recombinant BACE-2 (extracellular domain, expressed in baculovirus and purified using standard methods) at 0.1 to 10 nM concentrations is incubated w...
In DepthDetails US Patent