BDBM135687 US10179804, Example 72::US10632171, Peptide No. 72::US8846601, 72::US9458201, 72
SMILES CC(=O)N[C@H](CCCNC(N)=N)C(=O)N[C@H]1CC(=O)NCCCC[C@H](NC(=O)[C@H](Cc2c[nH]c3ccccc23)NC(=O)[C@H](CCCNC(N)=N)NC(=O)[C@@H](Cc2ccccc2)NC(=O)[C@@H]2C[C@@H](Cc3ccccc3)CN2C1=O)C(N)=O
InChI Key
Data  4 KI
  Tab Delimited (TSV)   2D SDfile   Computed 3D by Vconf -m prep SDfile
Find this compound or compounds like it in BindingDB:
Activity Spreadsheet -- Enzyme Inhibition Constant Data from BindingDB
Found 4 hits for monomerid = 135687
TargetMelanocortin receptor 4(Homo sapiens (Human))
Palatin Technologies
US Patent
LigandPNGBDBM135687(US10179804, Example 72 | US10632171, Peptide No. 7...)
Affinity DataKi:  2nMpH: 7.5Assay Description:A competitive inhibition binding assay is performed using membrane homogenates prepared from HEK-293 cells that express recombinant hMC4-R, hMC3-R, o...
In DepthDetails US Patent
TargetMelanocortin receptor 4(Homo sapiens (Human))
Palatin Technologies
US Patent
LigandPNGBDBM135687(US10179804, Example 72 | US10632171, Peptide No. 7...)
Affinity DataKi:  2nM. Assay description: A competitive inhibition binding assay is performed using membrane homogenates prepared from HEK-293 cells that express recombinant hMC4-R, hMC3-R, o...
In DepthDetails US Patent
TargetMelanocortin receptor 4(Homo sapiens (Human))
Palatin Technologies
US Patent
LigandPNGBDBM135687(US10179804, Example 72 | US10632171, Peptide No. 7...)
Affinity DataKi:  2nM. Assay description: Accumulation of intracellular cAMP was examined as a measure of the ability of the peptides of the present invention to elicit a functional response ...
In DepthDetails US Patent
TargetMelanocortin receptor 4(Homo sapiens (Human))
Palatin Technologies
US Patent
LigandPNGBDBM135687(US10179804, Example 72 | US10632171, Peptide No. 7...)
Affinity DataKi:  2nM ΔG°:  -12.3kcal/moleT: 2°C. Assay description: A competitive inhibition binding assay was performed employing Eu-NDP-α-MSH (PerkinElmer Life Sciences catalog No. AD0225) with determination b...
In DepthDetails US Patent