BDBM135765 US10179804, Example 150::US10632171, Peptide No. 150::US8846601, 150::US9458201, 150
SMILES CC(=O)N[C@@H](CCCNC(N)=N)C(=O)N[C@H]1CCCNC(=O)CC[C@H](NC(=O)[C@H](Cc2c[nH]c3ccccc23)NC(=O)[C@H](CCCNC(N)=N)NC(=O)[C@@H](Cc2ccccc2)NC(=O)[C@H](CCC(N)=O)NC1=O)C(N)=O
InChI Key
Data  8 KI  2 EC50
  Tab Delimited (TSV)   2D SDfile   Computed 3D by Vconf -m prep SDfile
Find this compound or compounds like it in BindingDB:
Activity Spreadsheet -- Enzyme Inhibition Constant Data from BindingDB
Found 10 hits for monomerid = 135765
TargetMelanocortin receptor 4(Homo sapiens (Human))
Palatin Technologies
US Patent
LigandPNGBDBM135765(US10179804, Example 150 | US10632171, Peptide No. ...)
Affinity DataKi:  5nM. Assay description: A competitive inhibition binding assay is performed using membrane homogenates prepared from HEK-293 cells that express recombinant hMC4-R, hMC3-R, o...
In DepthDetails US Patent
TargetMelanocortin receptor 4(Homo sapiens (Human))
Palatin Technologies
US Patent
LigandPNGBDBM135765(US10179804, Example 150 | US10632171, Peptide No. ...)
Affinity DataKi:  5nM ΔG°:  -11.8kcal/molepH: 7.5 T: 2°C. Assay description: A competitive inhibition binding assay is performed using membrane homogenates prepared from HEK-293 cells that express recombinant hMC4-R, hMC3-R, o...
In DepthDetails US Patent
TargetMelanocortin receptor 4(Homo sapiens (Human))
Palatin Technologies
US Patent
LigandPNGBDBM135765(US10179804, Example 150 | US10632171, Peptide No. ...)
Affinity DataKi:  5nMpH: 7.5Assay Description:A competitive inhibition binding assay is performed using membrane homogenates prepared from HEK-293 cells that express recombinant hMC4-R, hMC3-R, o...
In DepthDetails US Patent
TargetMelanocortin receptor 4(Homo sapiens (Human))
Palatin Technologies
US Patent
LigandPNGBDBM135765(US10179804, Example 150 | US10632171, Peptide No. ...)
Affinity DataKi:  5nM. Assay description: Accumulation of intracellular cAMP was examined as a measure of the ability of the peptides of the present invention to elicit a functional response ...
In DepthDetails US Patent
TargetMelanocortin receptor 4(Homo sapiens (Human))
Palatin Technologies
US Patent
LigandPNGBDBM135765(US10179804, Example 150 | US10632171, Peptide No. ...)
Affinity DataKi:  5nM. Assay description: A competitive inhibition binding assay is performed using membrane homogenates prepared from HEK-293 cells that express recombinant hMC4-R, hMC3-R, o...
In DepthDetails US Patent
TargetMelanocyte-stimulating hormone receptor(Homo sapiens (Human))
Palatin Technologies
US Patent
LigandPNGBDBM135765(US10179804, Example 150 | US10632171, Peptide No. ...)
Affinity DataKi:  130nMpH: 7.5Assay Description:A competitive inhibition binding assay is performed using membrane homogenates prepared from HEK-293 cells that express recombinant hMC4-R, hMC3-R, o...
In DepthDetails US Patent
TargetMelanocyte-stimulating hormone receptor(Homo sapiens (Human))
Palatin Technologies
US Patent
LigandPNGBDBM135765(US10179804, Example 150 | US10632171, Peptide No. ...)
Affinity DataKi:  130nM ΔG°:  -9.77kcal/molepH: 7.5 T: 2°C. Assay description: A competitive inhibition binding assay is performed using membrane homogenates prepared from HEK-293 cells that express recombinant hMC4-R, hMC3-R, o...
In DepthDetails US Patent
TargetMelanin-concentrating hormone receptor 1(Homo sapiens (Human))
Palatin Technologies
US Patent
LigandPNGBDBM135765(US10179804, Example 150 | US10632171, Peptide No. ...)
Affinity DataKi:  130nM. Assay description: A competitive inhibition binding assay is performed using membrane homogenates prepared from HEK-293 cells that express recombinant hMC4-R, hMC3-R, o...
In DepthDetails US Patent
TargetMelanocyte-stimulating hormone receptor(Homo sapiens (Human))
Palatin Technologies
US Patent
LigandPNGBDBM135765(US10179804, Example 150 | US10632171, Peptide No. ...)
Affinity DataEC50:  9nMpH: 7.5 T: 2°C. Assay description: Accumulation of intracellular cAMP was examined as a measure of the ability of the peptides of the present invention to elicit a functional response ...
In DepthDetails US Patent
TargetMelanocortin receptor 4(Homo sapiens (Human))
Palatin Technologies
US Patent
LigandPNGBDBM135765(US10179804, Example 150 | US10632171, Peptide No. ...)
Affinity DataEC50:  0.300nMpH: 7.5 T: 2°C. Assay description: Accumulation of intracellular cAMP was examined as a measure of the ability of the peptides of the present invention to elicit a functional response ...
In DepthDetails US Patent