BDBM185687 UNC10107968::US9156822, 17
SMILES CC(C)Oc1ccccc1N1CCCN(CCCCOc2ccc3CCC(=O)Nc3n2)CC1
InChI Key InChIKey=FRQVGTOODSSJIY-UHFFFAOYSA-N
Data  1 KI  2 EC50
  Tab Delimited (TSV)   2D SDfile   Computed 3D by Vconf -m prep SDfile
Find this compound or compounds like it in BindingDB:
Activity Spreadsheet -- Enzyme Inhibition Constant Data from BindingDB
Found 3 hits for monomerid = 185687
TargetD(2) dopamine receptor(Homo sapiens (Human))
University of North Carolina At Chapel Hill
US Patent
LigandPNGBDBM185687(UNC10107968 | US9156822, 17)
Affinity DataKi:  1.29nMpH: 7.4Assay Description:Membranes prepared as above were resuspended to 1 ug protein/ul (measured by Bradford assay using BSA as standard), and 50 ul were added to each well...
In DepthDetails US Patent
TargetD(2) dopamine receptor(Homo sapiens (Human))
University of North Carolina At Chapel Hill
US Patent
LigandPNGBDBM185687(UNC10107968 | US9156822, 17)
Affinity DataEC50:  4.60nMpH: 7.4Assay Description:Recruitment of β-arrestin to agonist-stimulated D2 receptors was performed using a previously described Tango-type assay (Barnea et al., Proc. N...
In DepthDetails US Patent
TargetD(2) dopamine receptor(Homo sapiens (Human))
University of North Carolina At Chapel Hill
US Patent
LigandPNGBDBM185687(UNC10107968 | US9156822, 17)
Affinity DataEC50:  0.200nMpH: 7.4Assay Description:HEK293T cells co-expressing the cAMP biosensor GloSensor-22F (Promega) and hD2 receptors were seeded (10,000 cells/20 ul/well) into white, clear-bott...
In DepthDetails US Patent