BDBM208280 US9266835, 51
SMILES COc1ccc(cc1)C(O)(c1ccc(Cl)cc1)c1ccc2[nH]c(=O)cc(NC3CCN(CC3)S(=O)(=O)C(F)(F)F)c2c1
InChI Key
Data  2 EC50
  Tab Delimited (TSV)   2D SDfile   Computed 3D by Vconf -m prep SDfile
Find this compound or compounds like it in BindingDB:
Activity Spreadsheet -- Enzyme Inhibition Constant Data from BindingDB
Found 2 hits for monomerid = 208280
TargetCannabinoid receptor 2(Homo sapiens (Human))
Janssen Pharmaceutica
US Patent
LigandPNGBDBM208280(US9266835, 51)
Affinity DataEC50:  8.28E+3nM. Assay description: The following mixtures and buffer solutions were prepared: (a) Buffer 1: HBSS (Mediatech Cat#21-023-CV) with 5 mM HEPES (1 mM stock, Gibco BRL Cat#15...
Ligand InfoPC cidPC sid
In DepthDetails US Patent
TargetCannabinoid receptor 1(Homo sapiens (Human))
Janssen Pharmaceutica
US Patent
LigandPNGBDBM208280(US9266835, 51)
Affinity DataEC50:  29nM. Assay description: The following mixtures and buffer solutions were prepared: (a) Buffer 1: HBSS (Mediatech Cat#21-023-CV) with 5 mM HEPES (1 mM stock, Gibco BRL Cat#15...
Ligand InfoPC cidPC sid
In DepthDetails US Patent