BDBM224021 BAM8-22::VGRPEWWMDYQKRYG
SMILES CSCC[C@H](NC(=O)[C@H](Cc1c[nH]c2ccccc12)NC(=O)[C@H](Cc1c[nH]c2ccccc12)NC(=O)[C@H](CCC(O)=O)NC(=O)[C@@H]1CCCN1C(=O)[C@H](CCCNC(N)=N)NC(=O)CNC(=O)[C@@H](N)C(C)C)C(=O)N[C@@H](CC(O)=O)C(=O)N[C@@H](Cc1ccc(O)cc1)C(=O)N[C@@H](CCC(N)=O)C(=O)N[C@@H](CCCCN)C(=O)N[C@@H](CCCNC(N)=N)C(=O)N[C@@H](Cc1ccc(O)cc1)C(=O)NCC(O)=O
InChI Key
Data  8 EC50
  Tab Delimited (TSV)   2D SDfile   Computed 3D by Vconf -m prep SDfile
Find this compound or compounds like it in BindingDB:
Activity Spreadsheet -- Enzyme Inhibition Constant Data from BindingDB
Found 2 hits for monomerid = 224021
TargetMas-related G-protein coupled receptor member X2(Homo sapiens (Human))
University Of North Carolina
LigandPNGBDBM224021(BAM8-22 | VGRPEWWMDYQKRYG)
Affinity DataEC50:  8.90E+3nMpH: 7.4 T: 2°C. Assay description: MRGPRX2 stable cells were maintained in DMEM containing 10% FBS, 100 μg/ml hygromycin B, and 15 μg/ml blasticidin. For the calcium mobiliza...
In DepthDetails ArticlePubMed
TargetMas-related G-protein coupled receptor member X2(Homo sapiens (Human))
University Of North Carolina
LigandPNGBDBM224021(BAM8-22 | VGRPEWWMDYQKRYG)
Affinity DataEC50:  1.10E+4nMpH: 7.4 T: 2°C. Assay description: HTLA cells (HEK-T cells stably expressing a β-arrestin2-TEV fusion protein and a tTa-dependent luciferase reporter) were maintained in DMEM (Cor...
In DepthDetails ArticlePubMed