BDBM23778 (2R)-2-amino-3-[(cyclohexyldiphenylmethyl)sulfanyl]propanoic acid::S-Trityl-L-Cysteine (STLC) Analogue, 7
SMILES N[C@@H](CSC(C1CCCCC1)(c1ccccc1)c1ccccc1)C(O)=O
InChI Key InChIKey=AKLAXSZOQYHFCN-FQEVSTJZSA-N
Data  1 KI
  Tab Delimited (TSV)   2D SDfile   Computed 3D by Vconf -m prep SDfile
Find this compound or compounds like it in BindingDB:
Activity Spreadsheet -- Enzyme Inhibition Constant Data from BindingDB
Found 1 hit for monomerid = 23778
TargetKinesin-like protein KIF11(Homo sapiens (Human))
Institut De Biologie Structurale
LigandPNGBDBM23778((2R)-2-amino-3-[(cyclohexyldiphenylmethyl)sulfanyl...)
Affinity DataKi:  175nM ΔG°:  -9.12kcal/molepH: 6.9 T: 2°C. Assay description: The microtubule-activated ATPase rates were measured using the pyruvate kinase/lactate dehydrogenase-linked assay. To optimize the signal for basal E...
In DepthDetails ArticlePubMed