BDBM237921 US9394285, 2
SMILES OCc1ccc(cc1)-c1cc2c(c[nH]c2cc1Cl)C(O)=O
InChI Key InChIKey=NOGWJYQSYBAMTO-UHFFFAOYSA-N
Data  1 Kd  2 EC50
  Tab Delimited (TSV)   2D SDfile   Computed 3D by Vconf -m prep SDfile
Find this compound or compounds like it in BindingDB:
Activity Spreadsheet -- Enzyme Inhibition Constant Data from BindingDB
Found 2 hits for monomerid = 237921
LigandPNGBDBM237921(US9394285, 2)
Affinity DataEC50:  64.7nMpH: 7.5 T: 2°C. Assay description: The biochemical EC50 (half-maximal concentration required for full activation) of compounds for the activation of AMPK was evaluated by 33P-based ass...
Ligand InfoPC cidPC sid
In DepthDetails US Patent
LigandPNGBDBM237921(US9394285, 2)
Affinity DataEC50:  53nM. Assay description: Activation of recombinant human AMPK alpha1/beta1/gamma1 using Cy5-labelled SAMS as substrate assessed as protection from Thr172 residue dephosphoryl...
Ligand InfoPC cidPC sid
In DepthDetails ArticlePubMed