BDBM23799 2-amino-3-methyl-3-[(triphenylmethyl)sulfanyl]butanoic acid::Triphenylmethyl-containing compound, 28
SMILES CC(C)(SC(c1ccccc1)(c1ccccc1)c1ccccc1)C(N)C(O)=O
InChI Key InChIKey=XSOLHQWRHYIXOC-UHFFFAOYSA-N
Data  1 KI
  Tab Delimited (TSV)   2D SDfile   Computed 3D by Vconf -m prep SDfile
Find this compound or compounds like it in BindingDB:
Activity Spreadsheet -- Enzyme Inhibition Constant Data from BindingDB
Found 1 hit for monomerid = 23799
TargetKinesin-like protein KIF11(Homo sapiens (Human))
Institut De Biologie Structurale
LigandPNGBDBM23799(2-amino-3-methyl-3-[(triphenylmethyl)sulfanyl]buta...)
Affinity DataKi:  5.23E+3nM ΔG°:  -7.13kcal/molepH: 6.9 T: 2°C. Assay description: The microtubule-activated ATPase rates were measured using the pyruvate kinase/lactate dehydrogenase-linked assay. To optimize the signal for basal E...
In DepthDetails ArticlePubMed