BDBM25092 3-[2-amino-7-(3-hydroxyphenyl)-4-{[3-(morpholin-4-yl)propyl]amino}pteridin-6-yl]phenol::aminopteridine derivative, 15
SMILES Nc1nc(NCCCN2CCOCC2)c2nc(-c3cccc(O)c3)c(nc2n1)-c1cccc(O)c1
InChI Key InChIKey=CCJWJJHYXGCRIY-UHFFFAOYSA-N
Data  1 IC50
  Tab Delimited (TSV)   2D SDfile   Computed 3D by Vconf -m prep SDfile
Find this compound or compounds like it in BindingDB:
Activity Spreadsheet -- Enzyme Inhibition Constant Data from BindingDB
Found 1 hit for monomerid = 25092
LigandPNGBDBM25092(3-[2-amino-7-(3-hydroxyphenyl)-4-{[3-(morpholin-4-...)
Affinity DataIC50:  5.10E+4nMpH: 7.4 T: 2°C. Assay description: The luminescence-based kinase assay with recombinant phosphatidylinositol 3-kinase (Upstate Cell Signaling Solutions) was used for the determination ...
In DepthDetails ArticlePubMed