BDBM253024 US9481685, 2
SMILES CCN(CC)C(=O)C1Sc2ccccc2-c2c1c1ccc(OC)cc1n2CCF
InChI Key InChIKey=FMJMFAYUNUEUSC-UHFFFAOYSA-N
Data  2 KI
  Tab Delimited (TSV)   2D SDfile   Computed 3D by Vconf -m prep SDfile
Find this compound or compounds like it in BindingDB:
Activity Spreadsheet -- Enzyme Inhibition Constant Data from BindingDB
Found 2 hits for monomerid = 253024
TargetTranslocator protein(Rattus norvegicus (rat))
Ge Healthcare
Curated by ChEMBL
LigandPNGBDBM253024(US9481685, 2)
Affinity DataKi:  0.400nM. Assay description: Displacement of [3H]PK11195 from PBR receptor in Wistar rat heart homogenates
Ligand InfoPC cidPC sid
In DepthDetails ArticlePubMed
TargetTranslocator protein(Rattus norvegicus (rat))
Ge Healthcare
Curated by ChEMBL
LigandPNGBDBM253024(US9481685, 2)
Affinity DataKi:  0.400nMpH: 7.4Assay Description:The compounds were screened for their affinity for PBR using a method adapted from Le Fur et al (Life Sci. 1983; USA 33: 449-57).The compounds to be ...
Ligand InfoPC cidPC sid
In DepthDetails US Patent