BDBM253653 US10179804, Example 132::US10632171, Peptide No. 132::US9458201, 132
SMILES CC(=O)N[C@@H](CCCCN)C(=O)N[C@H]1CCCNC(=O)CC[C@H](NC(=O)[C@H](Cc2c[nH]c3ccccc23)NC(=O)[C@H](CCCNC(N)=N)NC(=O)[C@@H](Cc2ccccc2)NC(=O)[C@H](Cc2c[nH]cn2)NC1=O)C(N)=O
InChI Key
Data  3 KI
  Tab Delimited (TSV)   2D SDfile   Computed 3D by Vconf -m prep SDfile
Find this compound or compounds like it in BindingDB:
Activity Spreadsheet -- Enzyme Inhibition Constant Data from BindingDB
Found 3 hits for monomerid = 253653
TargetMelanocortin receptor 4(Homo sapiens (Human))
Palatin Technologies
US Patent
LigandPNGBDBM253653(US10179804, Example 132 | US10632171, Peptide No. ...)
Affinity DataKi:  3nM ΔG°:  -12.1kcal/moleT: 2°C. Assay description: A competitive inhibition binding assay was performed employing Eu-NDP-α-MSH (PerkinElmer Life Sciences catalog No. AD0225) with determination b...
Ligand InfoPC cidPC sid
In DepthDetails US Patent
TargetMelanocortin receptor 4(Homo sapiens (Human))
Palatin Technologies
US Patent
LigandPNGBDBM253653(US10179804, Example 132 | US10632171, Peptide No. ...)
Affinity DataKi:  3nM. Assay description: A competitive inhibition binding assay is performed using membrane homogenates prepared from HEK-293 cells that express recombinant hMC4-R, hMC3-R, o...
Ligand InfoPC cidPC sid
In DepthDetails US Patent
TargetMelanocortin receptor 4(Homo sapiens (Human))
Palatin Technologies
US Patent
LigandPNGBDBM253653(US10179804, Example 132 | US10632171, Peptide No. ...)
Affinity DataKi:  3nM. Assay description: Accumulation of intracellular cAMP was examined as a measure of the ability of the peptides of the present invention to elicit a functional response ...
Ligand InfoPC cidPC sid
In DepthDetails US Patent