BDBM313790 US10167292, Example 34
SMILES Cc1nnn2CCN(c3ccc(Cl)cc3)c3cc(CO)ccc3-c12
InChI Key InChIKey=ORTRBMKXQWFMTN-UHFFFAOYSA-N
Data  10 IC50
  Tab Delimited (TSV)   2D SDfile   Computed 3D by Vconf -m prep SDfile
Find this compound or compounds like it in BindingDB:
Activity Spreadsheet -- Enzyme Inhibition Constant Data from BindingDB
Found 10 hits for monomerid = 313790
TargetBromodomain-containing protein 2 [91-163](Homo sapiens (Human))
Catalyst Therapeutics
US Patent
LigandPNGBDBM313790(US10167292, Example 34)
Affinity DataIC50:  550nM. Assay description: BRD binding and inhibition was assessed by measuring the interaction of biotinylated acetyl-histone H4 peptide (Anaspec #64989) with the BRD target p...
Ligand InfoPC cidPC sid
In DepthDetails US Patent
TargetBromodomain-containing protein 2 [364-436](Homo sapiens (Human))
Catalyst Therapeutics
US Patent
LigandPNGBDBM313790(US10167292, Example 34)
Affinity DataIC50: <100nM. Assay description: BRD binding and inhibition was assessed by measuring the interaction of biotinylated acetyl-histone H4 peptide (Anaspec #64989) with the BRD target p...
Ligand InfoPC cidPC sid
In DepthDetails US Patent
TargetBromodomain-containing protein 3 [51-123](Homo sapiens (Human))
Catalyst Therapeutics
US Patent
LigandPNGBDBM313790(US10167292, Example 34)
Affinity DataIC50: <100nM. Assay description: BRD binding and inhibition was assessed by measuring the interaction of biotinylated acetyl-histone H4 peptide (Anaspec #64989) with the BRD target p...
Ligand InfoPC cidPC sid
In DepthDetails US Patent
TargetBromodomain-containing protein 4 [75-147](Homo sapiens (Human))
Catalyst Therapeutics
US Patent
LigandPNGBDBM313790(US10167292, Example 34)
Affinity DataIC50: <100nM. Assay description: BRD binding and inhibition was assessed by measuring the interaction of biotinylated acetyl-histone H4 peptide (Anaspec #64989) with the BRD target p...
Ligand InfoPC cidPC sid
In DepthDetails US Patent
TargetBromodomain-containing protein 3(Homo sapiens (Human))
Walter And Eliza Hall Institute Of Medical Research
Curated by ChEMBL
LigandPNGBDBM313790(US10167292, Example 34)
Affinity DataIC50:  36nM. Assay description: Inhibition of human His-tagged Brd3 bromodomain 1 expressed in Escherichia coli BL21 (DE3) preincubated for 30 mins followed by addition of biotinyla...
Ligand InfoPC cidPC sid
In DepthDetails ArticlePubMed
TargetBromodomain-containing protein 2(Homo sapiens (Human))
Walter And Eliza Hall Institute Of Medical Research
Curated by ChEMBL
LigandPNGBDBM313790(US10167292, Example 34)
Affinity DataIC50:  388nM. Assay description: Inhibition of human His-tagged Brd2 bromodomain 1 expressed in Escherichia coli BL21 (DE3) preincubated for 30 mins followed by addition of biotinyla...
Ligand InfoPC cidPC sid
In DepthDetails ArticlePubMed
TargetBromodomain-containing protein 4(Homo sapiens (Human))
Walter And Eliza Hall Institute Of Medical Research
Curated by ChEMBL
LigandPNGBDBM313790(US10167292, Example 34)
Affinity DataIC50:  30nM. Assay description: Inhibition of human His-tagged Brd4 bromodomain 2 expressed in Escherichia coli BL21 (DE3) preincubated for 30 mins followed by addition of biotinyla...
Ligand InfoPC cidPC sid
In DepthDetails ArticlePubMed
TargetBromodomain-containing protein 2(Homo sapiens (Human))
Walter And Eliza Hall Institute Of Medical Research
Curated by ChEMBL
LigandPNGBDBM313790(US10167292, Example 34)
Affinity DataIC50:  40nM. Assay description: Inhibition of human His-tagged Brd2 bromodomain 2 expressed in Escherichia coli BL21 (DE3) preincubated for 30 mins followed by addition of biotinyla...
Ligand InfoPC cidPC sid
In DepthDetails ArticlePubMed
TargetBromodomain-containing protein 4(Homo sapiens (Human))
Walter And Eliza Hall Institute Of Medical Research
Curated by ChEMBL
LigandPNGBDBM313790(US10167292, Example 34)
Affinity DataIC50:  79nM. Assay description: Inhibition of human His-tagged Brd4 bromodomain 1 expressed in Escherichia coli BL21 (DE3) preincubated for 30 mins followed by addition of biotinyla...
Ligand InfoPC cidPC sid
In DepthDetails ArticlePubMed
TargetBromodomain-containing protein 4 [368-440](Homo sapiens (Human))
Catalyst Therapeutics
US Patent
LigandPNGBDBM313790(US10167292, Example 34)
Affinity DataIC50: <100nM. Assay description: BRD binding and inhibition was assessed by measuring the interaction of biotinylated acetyl-histone H4 peptide (Anaspec #64989) with the BRD target p...
Ligand InfoPC cidPC sid
In DepthDetails US Patent