BDBM313795 US10167292, Example 39
SMILES C[C@@H](NC(=O)c1ccc2-c3c(C)nnn3CCN(c3ccc(Cl)cc3)c2c1)c1ccccc1
InChI Key InChIKey=FBYKSRDDFYPNNO-QGZVFWFLSA-N
Data  10 IC50
  Tab Delimited (TSV)   2D SDfile   Computed 3D by Vconf -m prep SDfile
Find this compound or compounds like it in BindingDB:
Activity Spreadsheet -- Enzyme Inhibition Constant Data from BindingDB
Found 10 hits for monomerid = 313795
TargetBromodomain-containing protein 2 [91-163](Homo sapiens (Human))
Catalyst Therapeutics
US Patent
LigandPNGBDBM313795(US10167292, Example 39)
Affinity DataIC50: <100nM. Assay description: BRD binding and inhibition was assessed by measuring the interaction of biotinylated acetyl-histone H4 peptide (Anaspec #64989) with the BRD target p...
Ligand InfoPC cidPC sid
In DepthDetails US Patent
TargetBromodomain-containing protein 2 [364-436](Homo sapiens (Human))
Catalyst Therapeutics
US Patent
LigandPNGBDBM313795(US10167292, Example 39)
Affinity DataIC50: <100nM. Assay description: BRD binding and inhibition was assessed by measuring the interaction of biotinylated acetyl-histone H4 peptide (Anaspec #64989) with the BRD target p...
Ligand InfoPC cidPC sid
In DepthDetails US Patent
TargetBromodomain-containing protein 3 [51-123](Homo sapiens (Human))
Catalyst Therapeutics
US Patent
LigandPNGBDBM313795(US10167292, Example 39)
Affinity DataIC50: <100nM. Assay description: BRD binding and inhibition was assessed by measuring the interaction of biotinylated acetyl-histone H4 peptide (Anaspec #64989) with the BRD target p...
Ligand InfoPC cidPC sid
In DepthDetails US Patent
TargetBromodomain-containing protein 4 [75-147](Homo sapiens (Human))
Catalyst Therapeutics
US Patent
LigandPNGBDBM313795(US10167292, Example 39)
Affinity DataIC50: <100nM. Assay description: BRD binding and inhibition was assessed by measuring the interaction of biotinylated acetyl-histone H4 peptide (Anaspec #64989) with the BRD target p...
Ligand InfoPC cidPC sid
In DepthDetails US Patent
TargetBromodomain-containing protein 4(Homo sapiens (Human))
Walter And Eliza Hall Institute Of Medical Research
Curated by ChEMBL
LigandPNGBDBM313795(US10167292, Example 39)
Affinity DataIC50:  14nM. Assay description: Inhibition of human His-tagged Brd4 bromodomain 1 expressed in Escherichia coli BL21 (DE3) preincubated for 30 mins followed by addition of biotinyla...
Ligand InfoPC cidPC sid
In DepthDetails ArticlePubMed
TargetBromodomain-containing protein 3(Homo sapiens (Human))
Walter And Eliza Hall Institute Of Medical Research
Curated by ChEMBL
LigandPNGBDBM313795(US10167292, Example 39)
Affinity DataIC50:  13nM. Assay description: Inhibition of human His-tagged Brd3 bromodomain 1 expressed in Escherichia coli BL21 (DE3) preincubated for 30 mins followed by addition of biotinyla...
Ligand InfoPC cidPC sid
In DepthDetails ArticlePubMed
TargetBromodomain-containing protein 2(Homo sapiens (Human))
Walter And Eliza Hall Institute Of Medical Research
Curated by ChEMBL
LigandPNGBDBM313795(US10167292, Example 39)
Affinity DataIC50:  68nM. Assay description: Inhibition of human His-tagged Brd2 bromodomain 1 expressed in Escherichia coli BL21 (DE3) preincubated for 30 mins followed by addition of biotinyla...
Ligand InfoPC cidPC sid
In DepthDetails ArticlePubMed
TargetBromodomain-containing protein 2(Homo sapiens (Human))
Walter And Eliza Hall Institute Of Medical Research
Curated by ChEMBL
LigandPNGBDBM313795(US10167292, Example 39)
Affinity DataIC50:  20nM. Assay description: Inhibition of human His-tagged Brd2 bromodomain 2 expressed in Escherichia coli BL21 (DE3) preincubated for 30 mins followed by addition of biotinyla...
Ligand InfoPC cidPC sid
In DepthDetails ArticlePubMed
TargetBromodomain-containing protein 4(Homo sapiens (Human))
Walter And Eliza Hall Institute Of Medical Research
Curated by ChEMBL
LigandPNGBDBM313795(US10167292, Example 39)
Affinity DataIC50:  13nM. Assay description: Inhibition of human His-tagged Brd4 bromodomain 2 expressed in Escherichia coli BL21 (DE3) preincubated for 30 mins followed by addition of biotinyla...
Ligand InfoPC cidPC sid
In DepthDetails ArticlePubMed
TargetBromodomain-containing protein 4 [368-440](Homo sapiens (Human))
Catalyst Therapeutics
US Patent
LigandPNGBDBM313795(US10167292, Example 39)
Affinity DataIC50: <100nM. Assay description: BRD binding and inhibition was assessed by measuring the interaction of biotinylated acetyl-histone H4 peptide (Anaspec #64989) with the BRD target p...
Ligand InfoPC cidPC sid
In DepthDetails US Patent