BDBM31879 3-indolepropionic acid::Acid, 7
SMILES OC(=O)CCc1c[nH]c2ccccc12
InChI Key InChIKey=GOLXRNDWAUTYKT-UHFFFAOYSA-N
Data  1 IC50
PDB links: 10 PDB IDs match this monomer.
  Tab Delimited (TSV)   2D SDfile   Computed 3D by Vconf -m prep SDfile
Find this compound or compounds like it in BindingDB:
Activity Spreadsheet -- Enzyme Inhibition Constant Data from BindingDB
Found 1 hit for monomerid = 31879
TargetKynurenine--oxoglutarate transaminase 1(Homo sapiens (Human))
Virginia Tech
LigandPNGBDBM31879(3-indolepropionic acid | Acid, 7)
Affinity DataIC50:  1.40E+5nMpH: 7.5 T: 2°C. Assay description: A typical reaction mixture contains kynurenine, alpha-ketobutyrate, PLP and hKAT-I in the presence of test compound. The reaction mixture was incubat...
In DepthDetails ArticlePubMed