BDBM364565 6-(Benzofuran-2-yl)-2-(methylthio)imidazo[2,1-b][1,3,4]thiadiazole::US9862730, Example 1
SMILES CSc1nn2cc(nc2s1)-c1cc2ccccc2o1
InChI Key InChIKey=RRXRVGBFTJMNCG-UHFFFAOYSA-N
Data  6 IC50
  Tab Delimited (TSV)   2D SDfile   Computed 3D by Vconf -m prep SDfile
Find this compound or compounds like it in BindingDB:
Activity Spreadsheet -- Enzyme Inhibition Constant Data from BindingDB
Found 6 hits for monomerid = 364565
TargetProteinase-activated receptor 4(Homo sapiens (Human))
Bristol-Myers Squibb
US Patent
LigandPNGBDBM364565(6-(Benzofuran-2-yl)-2-(methylthio)imidazo[2,1-b][1...)
Affinity DataIC50:  14nM. Assay description: The FLIPR assay is an exemplary in vitro assay for measuring the activity of the PAR4 antagonists of the present invention. In this assay, intracellu...
Ligand InfoPC cidPC sid
In DepthDetails US Patent
TargetProteinase-activated receptor 4(Homo sapiens (Human))
Bristol-Myers Squibb
US Patent
LigandPNGBDBM364565(6-(Benzofuran-2-yl)-2-(methylthio)imidazo[2,1-b][1...)
Affinity DataIC50:  270nM. Assay description: Antagonist activity at PAR4 in human washed platelets assessed as inhibition of gamma-thrombin-induced platelet aggregation preincubated for 5 mins f...
Ligand InfoPC cidPC sid
In DepthDetails ArticlePubMed
TargetProteinase-activated receptor 4(Mus musculus)
China Pharmaceutical University
Curated by ChEMBL
LigandPNGBDBM364565(6-(Benzofuran-2-yl)-2-(methylthio)imidazo[2,1-b][1...)
Affinity DataIC50:  940nM. Assay description: Antagonist activity at PAR4 in ICR mouse platelet-rich plasma assessed as inhibition of PAR4 AP AYPGKF-NH2-induced platelet aggregation by photo-turb...
Ligand InfoPC cidPC sid
In DepthDetails ArticlePubMed
TargetProteinase-activated receptor 4(Homo sapiens (Human))
Bristol-Myers Squibb
US Patent
LigandPNGBDBM364565(6-(Benzofuran-2-yl)-2-(methylthio)imidazo[2,1-b][1...)
Affinity DataIC50:  14nM. Assay description: Inhibition of human PAR4 expressed in HEK293 cells assessed as Ala-(L-4-F-Phe)-Pro-Gly-Trp-Leu-Val-Lys-Asn-Gly-induced inhibition of calcium mobiliza...
Ligand InfoPC cidPC sid
In DepthDetails ArticlePubMed
TargetProteinase-activated receptor 4(Homo sapiens (Human))
Bristol-Myers Squibb
US Patent
LigandPNGBDBM364565(6-(Benzofuran-2-yl)-2-(methylthio)imidazo[2,1-b][1...)
Affinity DataIC50:  2.60E+3nM. Assay description: Antagonist activity at PAR4 in human platelet-rich plasma assessed as inhibition of gamma-thrombin-induced platelet aggregation preincubated for 5 mi...
Ligand InfoPC cidPC sid
In DepthDetails ArticlePubMed
TargetProteinase-activated receptor 4(Homo sapiens (Human))
Bristol-Myers Squibb
US Patent
LigandPNGBDBM364565(6-(Benzofuran-2-yl)-2-(methylthio)imidazo[2,1-b][1...)
Affinity DataIC50:  11nM. Assay description: Antagonist activity at full-length human PAR4 expressed in HEK293 cells assessed as inhibition of AYPGKF-induced intracellular calcium mobilization p...
Ligand InfoPC cidPC sid
In DepthDetails ArticlePubMed