BDBM393288 US9963443, Reference Example 14
SMILES CN([C@@H]1CCOC1)C(=O)C1CCN(CC1)c1cnccc1-n1cc(Cl)cn1
InChI Key InChIKey=UILLLRHSHNNGLR-MRXNPFEDSA-N
Data  1 IC50
  Tab Delimited (TSV)   2D SDfile   Computed 3D by Vconf -m prep SDfile
Find this compound or compounds like it in BindingDB:
Activity Spreadsheet -- Enzyme Inhibition Constant Data from BindingDB
Found 1 hit for monomerid = 393288
TargetCholesterol 24-hydroxylase(Homo sapiens (Human))
Takeda Pharmaceutical
US Patent
LigandPNGBDBM393288(US9963443, Reference Example 14)
Affinity DataIC50:  17nM. Assay description: For the measurement of CH24H inhibitory activity, using the human CH24H lysate prepared in Experimental Example 2, the amount of 24-HC produced from ...
Ligand InfoPC cidPC sid
In DepthDetails US Patent