BDBM393292 US9963443, Reference Example 21
SMILES Cc1cnc(s1)-c1ccncc1N1CCC(CC1)C(=O)N1CC(F)C1
InChI Key InChIKey=NGKDECHJIUPPDL-UHFFFAOYSA-N
Data  1 IC50
  Tab Delimited (TSV)   2D SDfile   Computed 3D by Vconf -m prep SDfile
Find this compound or compounds like it in BindingDB:
Activity Spreadsheet -- Enzyme Inhibition Constant Data from BindingDB
Found 1 hit for monomerid = 393292
TargetCholesterol 24-hydroxylase(Homo sapiens (Human))
Takeda Pharmaceutical
US Patent
LigandPNGBDBM393292(US9963443, Reference Example 21)
Affinity DataIC50:  4.90nM. Assay description: For the measurement of CH24H inhibitory activity, using the human CH24H lysate prepared in Experimental Example 2, the amount of 24-HC produced from ...
Ligand InfoPC cidPC sid
In DepthDetails US Patent