BDBM425897 US10512644, Compound alpha-6-mPEG3-O-Morphine
SMILES COCCOCCOCCO[C@H]1C=CC2C3Cc4ccc(O)c5O[C@@H]1[C@]2(CCN3C)c45
InChI Key InChIKey=ATTKETJQMFMYKG-UIQNEJLLSA-N
Data  3 KI  2 EC50
  Tab Delimited (TSV)   2D SDfile   Computed 3D by Vconf -m prep SDfile
Find this compound or compounds like it in BindingDB:
Activity Spreadsheet -- Enzyme Inhibition Constant Data from BindingDB
Found 2 hits for monomerid = 425897
TargetMu-type opioid receptor(Homo sapiens (Human))
Inheris Pharmaceuticals
US Patent
LigandPNGBDBM425897(US10512644, Compound alpha-6-mPEG3-O-Morphine)
Affinity DataEC50:  270nM. Assay description: Briefly, suspensions of cells expressing either the mu, kappa or delta opioid receptors were prepared in buffer containing 0.5 mM isobutyl-methyl xan...
Ligand InfoPC cidPC sid
In DepthDetails US Patent
TargetKappa-type opioid receptor(Homo sapiens (Human))
Inheris Pharmaceuticals
US Patent
LigandPNGBDBM425897(US10512644, Compound alpha-6-mPEG3-O-Morphine)
Affinity DataEC50:  4.20E+3nM. Assay description: Briefly, suspensions of cells expressing either the mu, kappa or delta opioid receptors were prepared in buffer containing 0.5 mM isobutyl-methyl xan...
Ligand InfoPC cidPC sid
In DepthDetails US Patent